hi3860v100语言模块代码报错

[OHOS ERROR] scons: *** [output\bin\Hi3861_wifiiot_app.out] Error 1

[OHOS ERROR] BUILD FAILED!!!!

[OHOS ERROR] Failed building output\bin\Hi3861_wifiiot_app.out: Error 1

[OHOS ERROR] you can check build log in F:\hi3861_hdu_iot_application\src\out\hispark_pegasus\wifiiot_hispark_pegasus\build.log

[OHOS ERROR] command: "F:\DevTools_Hi3861V100_v1.0\thirdparty\python38\scripts\ninja.exe -w dupbuild=warn -C F:\hi3861_hdu_iot_application\src\out\hispark_pegasus\wifiiot_hispark_pegasus" failed

[OHOS ERROR] return code: 1

[OHOS ERROR] execution path: F:\hi3861_hdu_iot_application\src

scons: *** [src\out\hispark_pegasus\wifiiot_hispark_pegasus\target.elf] Failed to build! 

hi3860v100
2024-05-28 10:18:52
浏览
收藏 0
回答 0
待解决
相关问题
运行flutter doctor -v后显示错误代码
577浏览 • 1回复 待解决
模块应用使用startAbility报错
652浏览 • 1回复 待解决
OpenHarmony-v4.0-Beta1 编译报错,求助
3268浏览 • 3回复 待解决
模块签名配置DevEcoStudio报错
6147浏览 • 2回复 待解决
Hi3861下使用CPP代码错误
4033浏览 • 1回复 待解决
如下代码报错报错原因是什么?
34浏览 • 1回复 待解决
编译hispark, pegasus, hi3861, wifi 代码失败
6730浏览 • 1回复 待解决
使用docker编译Hi3516DV300报错
7862浏览 • 1回复 待解决
鸿蒙开发板Hi3861烧录报错
9710浏览 • 3回复 待解决
windows下载code-2.0-canary编译Hi3861 报错
6401浏览 • 3回复 待解决