Execution failed for task ':entry:signDebugShell'. > Sign shell failed. For details, see the log.

Execution failed for task ':entry:signDebugShell'.

> Sign shell failed. For details, see the log.

* Try:

> Run with --stacktrace option to get the stack trace.

> Run with --info or --debug option to get more log output.

> Run with --scan to get full insights.

请问这个是什么问题啊?

DevEco Studio
鸿蒙
2023-07-21 16:15:40
浏览
收藏 0
回答 1
待解决
回答 1
按赞同
/
按时间
Caesa

看这个,大概就是签名报错,重新签名下再试试!


分享
微博
QQ
微信
回复
2023-07-24 12:25:09
相关问题
Error: Install eTS 3.1.0.0 failed.
1969浏览 • 1回复 待解决
Failed to start MySQL Monitor.
1784浏览 • 2回复 待解决
Failure[INSTALL_FAILED_BUNDLE_INFO_NOT_CONFIG]
2789浏览 • 1回复 待解决
ERROR_GET_BUNDLE_INSTALLER_FAILED
1315浏览 • 1回复 待解决
OpenHarmony提示同步失败:sync Failed
220浏览 • 1回复 待解决
previewer 一直loading failed怎么回事?
405浏览 • 1回复 待解决
大佬们,image decode failed 怎么解决
9762浏览 • 1回复 待解决
Failure[INSTALL_PARSE_FAILED_USESDK_ERROR]
8641浏览 • 5回复 已解决