ERROR_GET_BUNDLE_INSTALLER_FAILED

模拟器跑自己写的项目,运行出现ERROR_GET_BUNDLE_INSTALLER_FAILED,之前跑是还是正常的。DevEco Studio 3.1.1 Release


UI
Ability框架
2023-12-05 16:13:47
浏览
收藏 0
回答 1
待解决
回答 1
按赞同
/
按时间
Bessemer

本地模拟器嘛,清除本地模拟器数据重新启动或者新建个本地模拟器试试!


分享
微博
QQ
微信
回复
2023-12-06 11:54:26
相关问题
Failure[INSTALL_FAILED_BUNDLE_INFO_NOT_CONFIG]
3323浏览 • 1回复 待解决
Error: Install eTS 3.1.0.0 failed.
2502浏览 • 1回复 待解决
Failure[INSTALL_PARSE_FAILED_USESDK_ERROR]
9629浏览 • 5回复 已解决